Target
Plasminogen
Ligand
BDBM50218585
Substrate
Meas. Tech.
ChEMBL_155409 (CHEMBL766111)
IC50
10600±n/a nM
Citation
 Radau, GRauh, D Synthesis of a cyanopeptide-analogue with trypsin activating properties. Bioorg Med Chem Lett 10:779-81 (2000)  
Target
Name:
Plasminogen
Synonyms:
Activation peptide PLG Plasmin Plasmin heavy chain A, short form | Plasmin light chain B
Type:
Enzyme
Mol. Mass.:
90579.18
Organism:
Homo sapiens (Human)
Description:
Residue:
810
  
Inhibitor
Name:
BDBM50218585
Synonyms:
CHEMBL3085289
Type:
Small organic molecule
Emp. Form.:
C29H46N6O9S
Mol. Mass.:
654.775
SMILES:
[#6]-[#6]-[#6](-[#6])-[#6](-[#7]-[#6](=O)-[#6](-[#8])-[#6]-c1ccc(-[#8])cc1)-[#6](=O)-[#7]-1-[#6]-2-[#6]-[#6](-[#6]-[#6]-[#6]-2-[#6]-[#6]-1-[#6](=O)-[#7]-[#6]-[#6]-[#6]-[#6]\[#7]=[#6](\[#7])-[#7])-[#8]S([#8])(=O)=O
: