Target
D(4) dopamine receptor
Ligand
BDBM21398
Substrate
Meas. Tech.
ChEMBL_60989 (CHEMBL671607)
Ki
1.6±n/a nM
Citation
 Talaga, PMatagne, AKlitgaard, H Pharmacological evaluation of a diarylmethylene-piperidine derivative: a new potent atypical antipsychotic? Bioorg Med Chem Lett 11:1313-6 (2001)  
Target
Name:
D(4) dopamine receptor
Synonyms:
D(2C) dopamine receptor DOPAMINE D4.2 DRD4 Dopamine D4 receptor
Type:
Enzyme
Mol. Mass.:
48373.19
Organism:
Homo sapiens (Human)
Description:
P21917
Residue:
419
  
Inhibitor
Name:
BDBM21398
Synonyms:
4-[4-(4-Chloro-phenyl)-4-hydroxy-piperidin-1-yl]-1-(4-fluoro-phenyl)-butan-1-one;propionate(HCl) CHEMBL54 Haloperidol | Haloperidol, 1
Type:
Small organic molecule
Emp. Form.:
C21H23ClFNO2
Mol. Mass.:
375.864
SMILES:
OC1(CCN(CCCC(=O)c2ccc(F)cc2)CC1)c1ccc(Cl)cc1
: