Target
Prothrombin
Ligand
BDBM50216992
Substrate
Meas. Tech.
ChEMBL_209399 (CHEMBL811331)
Ki
18±n/a nM
Citation
 Cui, JJAraldi, GLReiner, JEReddy, KMKemp, SJHo, JZSiev, DVMamedova, LGibson, TSGaudette, JAMinami, NKAnderson, SMBradbury, AENolan, TGSemple, JE Non-covalent thrombin inhibitors featuring P3-heterocycles with P1-bicyclic arginine surrogates. Bioorg Med Chem Lett 12:2925-30 (2002)  
Target
Name:
Prothrombin
Synonyms:
Activation peptide fragment 1 Coagulation factor II Prothrombin precursor Thrombin heavy chain | Thrombin light chain
Type:
Protein
Mol. Mass.:
70029.57
Organism:
Homo sapiens (Human)
Description:
P00734
Residue:
622
  
Inhibitor
Name:
BDBM50216992
Synonyms:
CHEMBL98859
Type:
Small organic molecule
Emp. Form.:
C23H23FN6O3
Mol. Mass.:
450.4655
SMILES:
Cc1cnc(NCCc2ccc(F)cc2)c(=O)n1CC(=O)NCc1ccc2c(N)noc2c1
: