Target
Corticotropin-releasing factor receptor 1/2
Ligand
BDBM50218669
Substrate
Meas. Tech.
ChEMBL_217368 (CHEMBL822880)
Ki
127±n/a nM
Citation
 Hartz, RAGilligan, PJNanda, KKTebben, AJFitzgerald, LWMiller, K Synthesis and evaluation of imidazo[1,5-a]pyrazines as corticotropin releasing hormone receptor ligands. Bioorg Med Chem Lett 12:291-4 (2002)  
Target
Name:
Corticotropin-releasing factor receptor 1/2
Synonyms:
Corticotropin releasing factor receptor
Type:
Mol. Mass.:
Description:
ASSAY_ID of ChEMBL is 217368
Components:
This complex has 2 components.
Component 1
Name:
Corticotropin-releasing factor receptor 1
Synonyms:
CRF-R CRFR1_RAT Corticotropin releasing factor receptor Corticotropin-releasing Factor Receptor 1 Crhr | Crhr1
Type:
G Protein-Coupled Receptor (GPCR)
Mol. Mass.:
47870.75
Organism:
Rattus norvegicus (rat)
Description:
Receptor binding assays were performed using rat cortex homogenate.
Residue:
415
  
Component 2
Name:
Corticotropin-releasing factor receptor 2
Synonyms:
CRF-R-2 CRF2 Beta CRFR2_RAT CRH-R2 Corticotropin-releasing factor receptor 2 Crf2r | Crhr2
Type:
Enzyme Catalytic Domain
Mol. Mass.:
47697.09
Organism:
RAT
Description:
CRF2 Beta 0 RAT::P47866
Residue:
411
  
Inhibitor
Name:
BDBM50218669
Synonyms:
CHEMBL97868
Type:
Small organic molecule
Emp. Form.:
C18H21Cl2N5
Mol. Mass.:
378.299
SMILES:
CCN(CC)c1nccn2c(Nc3ccc(Cl)cc3Cl)nc(CC)c12
: