Target
cAMP-specific 3',5'-cyclic phosphodiesterase 4C
Ligand
BDBM50221002
Substrate
Meas. Tech.
ChEMBL_157228 (CHEMBL769552)
IC50
>10.0±n/a nM
Citation
 Kim, EChun, HOJung, SHKim, JHLee, JMSuh, BCXiang, MXRhee, CK Improvement of therapeutic index of phosphodiesterase type IV inhibitors as anti-Asthmatics. Bioorg Med Chem Lett 13:2355-8 (2003)  
Target
Name:
cAMP-specific 3',5'-cyclic phosphodiesterase 4C
Synonyms:
Dpde1 Pde4c
Type:
PROTEIN
Mol. Mass.:
60038.21
Organism:
Rattus norvegicus
Description:
ChEMBL_104732
Residue:
536
  
Inhibitor
Name:
BDBM50221002
Synonyms:
CHEMBL306320
Type:
Small organic molecule
Emp. Form.:
C15H22N4O2
Mol. Mass.:
290.3608
SMILES:
[#6]-[#8]-c1ccc(cc1-[#8]-[#6]-1-[#6]-[#6]-[#6]-[#6]-1)-[#6](\[#6])=[#7]\[#7]=[#6](/[#7])-[#7]
: