Target
5-hydroxytryptamine receptor 7
Ligand
BDBM50222055
Substrate
Meas. Tech.
ChEMBL_3765 (CHEMBL857990)
Ki
26±n/a nM
Citation
 Parikh, VWelch, WMSchmidt, AW Discovery of a series of (4,5-dihydroimidazol-2-yl)-biphenylamine 5-HT7 agonists. Bioorg Med Chem Lett 13:269-71 (2003)  
Target
Name:
5-hydroxytryptamine receptor 7
Synonyms:
5-HT-7 5-HT7 5-HT7S 5-hydroxytryptamine receptor 7 5HT7R_RAT GPRFO Serotonin (5-HT) receptor | Serotonin Receptor 7
Type:
G Protein-Coupled Receptor (GPCR)
Mol. Mass.:
49852.62
Organism:
Rattus norvegicus (rat)
Description:
Rat cloned 5-HT7R.
Residue:
448
  
Inhibitor
Name:
BDBM50222055
Synonyms:
CHEMBL327906
Type:
Small organic molecule
Emp. Form.:
C16H16ClN3
Mol. Mass.:
285.771
SMILES:
Cc1c(NC2=NCCN2)cccc1-c1cccc(Cl)c1
: