Target
Mitogen-activated protein kinase 13
Ligand
BDBM50222108
Substrate
Meas. Tech.
ChEMBL_124320 (CHEMBL732628)
IC50
9.0±n/a nM
Citation
 Natarajan, SRWisnoski, DDSingh, SBStelmach, JEO'Neill, EASchwartz, CDThompson, CMFitzgerald, CEO'Keefe, SJKumar, SHop, CEZaller, DMSchmatz, DMDoherty, JB p38MAP kinase inhibitors. Part 1: design and development of a new class of potent and highly selective inhibitors based on 3,4-dihydropyrido[3,2-d]pyrimidone scaffold. Bioorg Med Chem Lett 13:273-6 (2003)  
Target
Name:
Mitogen-activated protein kinase 13
Synonyms:
MAP kinase 13 MAPK 13 Mapk13 Mitogen-activated protein kinase p38 delta Stress-activated protein kinase 4
Type:
PROTEIN
Mol. Mass.:
42081.17
Organism:
Mus musculus
Description:
ChEMBL_105000
Residue:
366
  
Inhibitor
Name:
BDBM50222108
Synonyms:
CHEMBL93028
Type:
Small organic molecule
Emp. Form.:
C26H23Cl2F2N5OS
Mol. Mass.:
562.462
SMILES:
CCN1CC2CC1CN2c1cc2N(C(=O)NCc2nc1Sc1ccc(F)cc1F)c1c(Cl)cccc1Cl
: