Target
Beta-1/Beta-2/Beta-3 adrenergic receptor
Ligand
BDBM50029051
Substrate
Meas. Tech.
ChEMBL_38740 (CHEMBL651098)
IC50
1000±n/a nM
Citation
 Kirk, KLCantacuzčne, DCollins, BChen, GTNimit, YCreveling, CR Syntheses and adrenergic agonist properties of ring-fluorinated isoproterenols. J Med Chem 25:680-4 (1982)  
Target
Name:
Beta-1/Beta-2/Beta-3 adrenergic receptor
Synonyms:
Adrenergic receptor beta
Type:
Mol. Mass.:
Description:
ASSAY_ID of ChEMBL is 1340543
Components:
This complex has 3 components.
Component 1
Name:
Beta-1 adrenergic receptor
Synonyms:
ADRB1R, B1AR Adrb1 Adrenergic receptor beta Beta-1 adrenoreceptor adrenergic Beta1,2
Type:
Protein
Mol. Mass.:
50486.84
Organism:
Rattus norvegicus (Rat)
Description:
P18090
Residue:
466
  
Component 2
Name:
Beta-2 adrenergic receptor
Synonyms:
ADRB2_RAT Adrb2r | Adrenergic receptor beta
Type:
PROTEIN
Mol. Mass.:
46896.26
Organism:
Rattus norvegicus
Description:
ChEMBL_38603
Residue:
418
  
Component 3
Name:
Beta-3 adrenergic receptor
Synonyms:
ADRB3_RAT Adrb3r Beta-3 adrenergic receptor
Type:
PROTEIN
Mol. Mass.:
43161.83
Organism:
Rattus norvegicus
Description:
ChEMBL_1509452
Residue:
400
  
Inhibitor
Name:
BDBM50029051
Synonyms:
(-)-arterenol (-)-norepinephrine (R)-4-(2-amino-1-hydroxyethyl)-1,2-benzenediol (R)-norepinephrine CHEMBL1437 | NOREPINEPHRINE
Type:
Small organic molecule
Emp. Form.:
C8H11NO3
Mol. Mass.:
169.1778
SMILES:
NC[C@H](O)c1ccc(O)c(O)c1
: