Target
Alpha-2A adrenergic receptor [16-465]/Alpha-2B adrenergic receptor/Alpha-2C adrenergic receptor
Ligand
BDBM50225285
Substrate
Meas. Tech.
ChEMBL_32321 (CHEMBL643679)
Ki
30±n/a nM
Citation
 DeBernardis, JFKerkman, DJWinn, MBush, ENArendsen, DLMcClellan, WJKyncl, JJBasha, FZ Conformationally defined adrenergic agents. 1. Design and synthesis of novel alpha 2 selective adrenergic agents: electrostatic repulsion based conformational prototypes. J Med Chem 28:1398-404 (1985)  
Target
Name:
Alpha-2A adrenergic receptor [16-465]/Alpha-2B adrenergic receptor/Alpha-2C adrenergic receptor
Synonyms:
Adrenergic receptor alpha-2
Type:
Mol. Mass.:
Description:
ASSAY_ID of ChEMBL is 935397
Components:
This complex has 3 components.
Component 1
Name:
Alpha-2C adrenergic receptor
Synonyms:
ADA2C_RAT Adrenergic receptor alpha adrenergic Alpha2 | adrenergic Alpha2C
Type:
Enzyme Catalytic Domain
Mol. Mass.:
49890.50
Organism:
RAT
Description:
adrenergic Alpha2 0 RAT::P22086
Residue:
458
  
Component 2
Name:
Alpha-2B adrenergic receptor
Synonyms:
ADA2B_RAT Adrenergic receptor alpha Alpha-2B adrenergic receptor Alpha-2B adrenoreceptor | adrenergic Alpha2B
Type:
Enzyme Catalytic Domain
Mol. Mass.:
50379.83
Organism:
NEONATAL RAT
Description:
adrenergic Alpha2B ADRA2B NEONATAL RAT::P19328
Residue:
453
  
Component 3
Name:
Alpha-2A adrenergic receptor [16-465]
Synonyms:
ADA2A_RAT Adrenaline 2 Alpha-2A adrenoceptor Alpha-2AAR Alpha2 Adrenoreceptor adrenergic Alpha2A
Type:
G-protein coupled receptor
Mol. Mass.:
48961.69
Organism:
Rattus norvegicus (rat)
Description:
P22909[16-465]
Residue:
450
  
Inhibitor
Name:
BDBM50225285
Synonyms:
CHEBI:3757 Catapres-Tts-1 Catapres-Tts-3 Clorpres Duraclon ST-155BS
Type:
Small organic molecule
Emp. Form.:
C9H9Cl2N3
Mol. Mass.:
230.094
SMILES:
Clc1cccc(Cl)c1NC1=NCCN1
: