Target
D(3) dopamine receptor
Ligand
BDBM50020680
Substrate
Meas. Tech.
ChEMBL_59724 (CHEMBL672966)
EC50
100±n/a nM
Citation
 Gallagher, GLavanchy, PGWebster, CAWilson, JWHieble, JPDeMarinis, RM 4-[2-(Di-n-propylamino)ethyl]-2(3H)-indolone: a prejunctional dopamine receptor agonist. J Med Chem 28:1533-6 (1985)  
Target
Name:
D(3) dopamine receptor
Synonyms:
DOPAMINE D3 DRD3_HUMAN Dopamine D3 receptor (D3) Dopamine receptor Dopamine receptor D3
Type:
Mol. Mass.:
44243.43
Organism:
Homo sapiens (Human)
Description:
Residue:
400
  
Inhibitor
Name:
BDBM50020680
Synonyms:
4-[2-(dipropylamino)ethyl]-1,3-dihydro-2H-indol-2-one ROPINIROLE
Type:
Small organic molecule
Emp. Form.:
C16H24N2O
Mol. Mass.:
260.3746
SMILES:
CCCN(CCC)CCc1cccc2NC(=O)Cc12
: