Target
Delta-type opioid receptor/Kappa-type opioid receptor/Mu-type opioid receptor/Sigma non-opioid intracellular receptor 1
Ligand
BDBM50225932
Substrate
Meas. Tech.
ChEMBL_146277 (CHEMBL756522)
EC50
90±n/a nM
Citation
 Lessor, RABajwa, BSRice, KCJacobson, AEStreaty, RAKlee, WASmith, CBAceto, MDMay, ELHarris, LS Probes for narcotic receptor mediated phenomena. 13. Potential irreversible narcotic antagonist-based ligands derived from 6,14-endo-ethenotetrahydronororipavine with 7-(methoxyfumaroyl)amino, (bromoacetyl)amino, or isothiocyanate electrophiles: chemistry, biochemistry, and pharmacology. J Med Chem 29:2136-41 (1986)  
Target
Name:
Delta-type opioid receptor/Kappa-type opioid receptor/Mu-type opioid receptor/Sigma non-opioid intracellular receptor 1
Synonyms:
Opioid receptor
Type:
Mol. Mass.:
Description:
ASSAY_ID of ChEMBL is 172778
Components:
This complex has 4 components.
Component 1
Name:
Mu-type opioid receptor
Synonyms:
MOR-1 Mu-type opioid receptor (MOR) OPRM_RAT Opioid receptor B Ror-b
Type:
G Protein-Coupled Receptor (GPCR)
Mol. Mass.:
44503.11
Organism:
Rattus norvegicus (rat)
Description:
Competition binding assays were carried out using membrane preparations from transfected HN9.10 cells that constitutively expressed the mu opioid receptor.
Residue:
398
  
Component 2
Name:
Sigma non-opioid intracellular receptor 1
Synonyms:
Opioid receptor SGMR1_RAT Sigma non-opioid intracellular receptor 1 Sigma-1 | Sigmar1
Type:
Enzyme Catalytic Domain
Mol. Mass.:
25266.54
Organism:
RAT
Description:
Q9R0C9
Residue:
223
  
Component 3
Name:
Kappa-type opioid receptor
Synonyms:
KOR-1 OPIATE Kappa Opioid receptor Ror-d
Type:
G Protein-Coupled Receptor (GPCR)
Mol. Mass.:
42692.90
Organism:
Rattus norvegicus (rat)
Description:
P34975
Residue:
380
  
Component 4
Name:
Delta-type opioid receptor
Synonyms:
Cytochrome P450 3A4 Delta opioid receptor Delta-type opioid receptor (DOR) OPRD_RAT Opioid receptor Opioid receptors; mu & delta Ror-a | Voltage-gated potassium channel
Type:
G Protein-Coupled Receptor (GPCR)
Mol. Mass.:
40465.04
Organism:
Rattus norvegicus (rat)
Description:
Competition binding assays were using CHO-K1 cell membranes expressing the opioid receptor.
Residue:
372
  
Inhibitor
Name:
BDBM50225932
Synonyms:
CHEMBL2310918
Type:
Small organic molecule
Emp. Form.:
C26H29BrN2O8
Mol. Mass.:
577.421
SMILES:
OC(=O)C(O)=O.[H][C@@]12Oc3c4c(C[C@@]5([H])N(CC=C)CC[C@@]14[C@]51C[C@H](NC(=O)CBr)C2(OC)C=C1)ccc3O
: