Target
Voltage-dependent L-type calcium channel subunit alpha-1S
Ligand
BDBM50226129
Substrate
Meas. Tech.
ChEMBL_42923 (CHEMBL654566)
Ki
0.499000±n/a nM
Citation
 Tamazawa, KArima, HKojima, TIsomura, YOkada, MFujita, SFuruya, TTakenaka, TInagaki, OTerai, M Stereoselectivity of a potent calcium antagonist, 1-benzyl-3-pyrrolidinyl methyl 2,6-dimethyl-4-(m-nitrophenyl)-1,4-dihydropyridine-3,5-dicarboxylate. J Med Chem 29:2504-11 (1986)  
Target
Name:
Voltage-dependent L-type calcium channel subunit alpha-1S
Synonyms:
CAC1S_RAT Cacn1 Cacnl1a3 Cchl1a3 Voltage-gated L-type calcium channel Voltage-gated calcium channel subunit alpha Cav1.1
Type:
PROTEIN
Mol. Mass.:
210392.58
Organism:
Rattus norvegicus
Description:
ChEMBL_92777
Residue:
1850
  
Inhibitor
Name:
BDBM50226129
Synonyms:
CHEMBL1314450
Type:
Small organic molecule
Emp. Form.:
C26H29N3O6
Mol. Mass.:
479.525
SMILES:
COC(=O)C1=C(C)NC(C)=C([C@H]1c1cccc(c1)[N+]([O-])=O)C(=O)OCCN(C)Cc1ccccc1
: