Target
Alpha-2A adrenergic receptor [16-465]/Alpha-2B adrenergic receptor/Alpha-2C adrenergic receptor
Ligand
BDBM50029051
Substrate
Meas. Tech.
ChEMBL_34213 (CHEMBL649229)
Ki
37±n/a nM
Citation
 DeBernardis, JFKerkman, DJArendsen, DLBuckner, SAKyncl, JJHancock, AA Conformationally defined adrenergic agents. 5. Resolution, absolute configuration, and pharmacological characterization of the enantiomers of 2-(5,6-dihydroxy-1,2,3,4-tetrahydro-1-naphthyl)imidazoline: a potent agonist at alpha-adrenoceptors. J Med Chem 30:1011-7 (1987)  
Target
Name:
Alpha-2A adrenergic receptor [16-465]/Alpha-2B adrenergic receptor/Alpha-2C adrenergic receptor
Synonyms:
Adrenergic receptor alpha-2
Type:
Mol. Mass.:
Description:
ASSAY_ID of ChEMBL is 935397
Components:
This complex has 3 components.
Component 1
Name:
Alpha-2C adrenergic receptor
Synonyms:
ADA2C_RAT Adrenergic receptor alpha adrenergic Alpha2 | adrenergic Alpha2C
Type:
Enzyme Catalytic Domain
Mol. Mass.:
49890.50
Organism:
RAT
Description:
adrenergic Alpha2 0 RAT::P22086
Residue:
458
  
Component 2
Name:
Alpha-2B adrenergic receptor
Synonyms:
ADA2B_RAT Adrenergic receptor alpha Alpha-2B adrenergic receptor Alpha-2B adrenoreceptor | adrenergic Alpha2B
Type:
Enzyme Catalytic Domain
Mol. Mass.:
50379.83
Organism:
NEONATAL RAT
Description:
adrenergic Alpha2B ADRA2B NEONATAL RAT::P19328
Residue:
453
  
Component 3
Name:
Alpha-2A adrenergic receptor [16-465]
Synonyms:
ADA2A_RAT Adrenaline 2 Alpha-2A adrenoceptor Alpha-2AAR Alpha2 Adrenoreceptor adrenergic Alpha2A
Type:
G-protein coupled receptor
Mol. Mass.:
48961.69
Organism:
Rattus norvegicus (rat)
Description:
P22909[16-465]
Residue:
450
  
Inhibitor
Name:
BDBM50029051
Synonyms:
(-)-arterenol (-)-norepinephrine (R)-4-(2-amino-1-hydroxyethyl)-1,2-benzenediol (R)-norepinephrine CHEMBL1437 | NOREPINEPHRINE
Type:
Small organic molecule
Emp. Form.:
C8H11NO3
Mol. Mass.:
169.1778
SMILES:
NC[C@H](O)c1ccc(O)c(O)c1
: