Target
cGMP-inhibited 3',5'-cyclic phosphodiesterase 3A/3B
Ligand
BDBM50226555
Substrate
Meas. Tech.
ChEMBL_217319 (CHEMBL821993)
IC50
290±n/a nM
Citation
 Venuti, MCStephenson, RAAlvarez, RBruno, JJStrosberg, AM Inhibitors of cyclic AMP phosphodiesterase. 3. Synthesis and biological evaluation of pyrido and imidazolyl analogues of 1,2,3,5-tetrahydro-2-oxoimidazo[2,1-b]quinazoline. J Med Chem 31:2136-45 (1988)  
Target
Name:
cGMP-inhibited 3',5'-cyclic phosphodiesterase 3A/3B
Synonyms:
Phosphodiesterase (PDE3) Phosphodiesterase 3 (PDE3) | cGMP-inhibited 3',5'-cyclic phosphodiesterase A/B
Type:
Mol. Mass.:
Description:
ASSAY_ID of ChEMBL is 156458
Components:
This complex has 2 components.
Component 1
Name:
cGMP-inhibited 3',5'-cyclic phosphodiesterase 3B
Synonyms:
CGI-PDE B CGIPDE1 PDE3B Phosphodiesterase 3B Phosphodiesterase Type 3 (PDE3B) cGMP-inhibited 3,5-cyclic phosphodiesterase B
Type:
Enzyme
Mol. Mass.:
124318.95
Organism:
Homo sapiens (Human)
Description:
PDE3B was generated from the full-length recombinant human clone transfected into Sf9 cells.
Residue:
1112
  
Component 2
Name:
cGMP-inhibited 3',5'-cyclic phosphodiesterase 3A
Synonyms:
3',5'-cyclic phosphodiesterase Cyclic GMP-inhibited phosphodiesterase A PDE3A_HUMAN Phosphodiesterase 3 (PDE3) Phosphodiesterase 3A Phosphodiesterase 3A (PDE3A1) cGMP-inhibited 3',5'-cyclic phosphodiesterase A | cGMP-inhibited 3,5-cyclic phosphodiesterase A
Type:
Enzyme
Mol. Mass.:
124966.46
Organism:
Homo sapiens (Human)
Description:
Q14432
Residue:
1141
  
Inhibitor
Name:
BDBM50226555
Synonyms:
CHEMBL67513
Type:
Small organic molecule
Emp. Form.:
C16H21N3O2
Mol. Mass.:
287.3568
SMILES:
CCCCCCOc1ccc2N=C3NC(=O)CN3Cc2c1
: