Target
Dihydrofolate reductase
Ligand
BDBM50227266
Substrate
Meas. Tech.
ChEBML_54731
Ki
0.977237±n/a nM
Citation
 Li, RLPoe, M Quantitative structure-activity relationships for the inhibition of Escherichia coli dihydrofolate reductase by 5-(substituted benzyl)-2,4-diaminopyrimidines. J Med Chem 31:366-70 (1988)  
Target
Name:
Dihydrofolate reductase
Synonyms:
Dihydrofolate reductase (F31V) | dfrA17
Type:
Mol. Mass.:
17532.46
Organism:
Escherichia coli
Description:
Residue:
157
  
Inhibitor
Name:
BDBM50227266
Synonyms:
CHEMBL332237
Type:
Small organic molecule
Emp. Form.:
C16H22N4O2
Mol. Mass.:
302.3715
SMILES:
CCCCOc1ccc(Cc2cnc(N)nc2N)cc1OC
: