Target
Dihydrofolate reductase
Ligand
BDBM50227267
Substrate
Meas. Tech.
ChEBML_54731
Ki
1.1±n/a nM
Citation
 Li, RLPoe, M Quantitative structure-activity relationships for the inhibition of Escherichia coli dihydrofolate reductase by 5-(substituted benzyl)-2,4-diaminopyrimidines. J Med Chem 31:366-70 (1988)  
Target
Name:
Dihydrofolate reductase
Synonyms:
Dihydrofolate reductase (F31V) | dfrA17
Type:
Mol. Mass.:
17532.46
Organism:
Escherichia coli
Description:
Residue:
157
  
Inhibitor
Name:
BDBM50227267
Synonyms:
CHEMBL122883
Type:
Small organic molecule
Emp. Form.:
C15H19BrN4O2
Mol. Mass.:
367.241
SMILES:
CCCOc1cc(Cc2cnc(N)nc2N)cc(Br)c1OC
: