Target
Dihydrofolate reductase
Ligand
BDBM50027972
Substrate
Meas. Tech.
ChEMBL_54735 (CHEMBL667186)
Ki
0.029±n/a nM
Citation
 Doweyko, AM The hypothetical active site lattice. An approach to modelling active sites from data on inhibitor molecules. J Med Chem 31:1396-406 (1988)  
Target
Name:
Dihydrofolate reductase
Synonyms:
Dihydrofolate reductase (F31V) | dfrA17
Type:
Mol. Mass.:
17532.46
Organism:
Escherichia coli
Description:
Residue:
157
  
Inhibitor
Name:
BDBM50027972
Synonyms:
7-[2-Bromo-5-(2,4-diamino-pyrimidin-5-ylmethyl)-3-methoxy-phenoxy]-heptanoic acid | CHEMBL31713
Type:
Small organic molecule
Emp. Form.:
C19H25BrN4O4
Mol. Mass.:
453.33
SMILES:
COc1cc(Cc2cnc(N)nc2N)cc(OCCCCCCC(O)=O)c1Br
: