Target
5-hydroxytryptamine receptor 1A/1B/1D/1F
Ligand
BDBM50016489
Substrate
Meas. Tech.
ChEMBL_769 (CHEMBL615871)
IC50
360±n/a nM
Citation
 Ward, JSFuller, RWMerritt, LSnoddy, HDPaschal, JWMason, NRHorng, JS Ergolines as selective 5-HT1 agonists. J Med Chem 31:1512-9 (1988)  
Target
Name:
5-hydroxytryptamine receptor 1A/1B/1D/1F
Synonyms:
Serotonin 1 (5-HT1) receptor
Type:
Mol. Mass.:
Description:
ASSAY_ID of ChEMBL is 193825
Components:
This complex has 4 components.
Component 1
Name:
5-hydroxytryptamine receptor 1D
Synonyms:
5-HT-1D 5-hydroxytryptamine receptor 1D Htr1d Serotonin 1B/1D receptor | Serotonin receptor 1D
Type:
Enzyme Catalytic Domain
Mol. Mass.:
41551.75
Organism:
RAT
Description:
5-HT1D HTR1D RAT::P28565
Residue:
374
  
Component 2
Name:
5-hydroxytryptamine receptor 1A
Synonyms:
5-HT-1A 5-HT1A 5-hydroxytryptamine receptor 1A (5HT1A) 5ht1a Htr1a Serotonin 1a (5-HT1a) receptor/Adrenergic receptor alpha-1 | Serotonin receptor 1A
Type:
G Protein-Coupled Receptor (GPCR)
Mol. Mass.:
46445.29
Organism:
Rattus norvegicus (rat)
Description:
Binding assays were performed using rat hippocampal membranes.
Residue:
422
  
Component 3
Name:
5-hydroxytryptamine receptor 1B
Synonyms:
5-HT-1B 5-hydroxytryptamine receptor 1B (5HT1B) 5ht1b Serotonin 1 (5-HT1) receptor Serotonin receptor 1B
Type:
Protein
Mol. Mass.:
43173.33
Organism:
Rattus norvegicus (Rat)
Description:
P28564
Residue:
386
  
Component 4
Name:
5-hydroxytryptamine receptor 1F
Synonyms:
5-HT-1F 5-hydroxytryptamine receptor 1F 5ht1f Serotonin 1 (5-HT1) receptor Serotonin receptor 1F
Type:
Enzyme Catalytic Domain
Mol. Mass.:
41896.93
Organism:
RAT
Description:
5-HT1F HTR1F RAT::P30940
Residue:
366
  
Inhibitor
Name:
BDBM50016489
Synonyms:
(6aR,9R,10aR)-7,9-Dimethyl-4,6,6a,7,8,9,10,10a-octahydro-indolo[4,3-fg]quinoline CHEMBL13866
Type:
Small organic molecule
Emp. Form.:
C16H20N2
Mol. Mass.:
240.3434
SMILES:
C[C@@H]1C[C@H]2[C@@H](Cc3c[nH]c4cccc2c34)N(C)C1
: