Target
Sterol O-acyltransferase 1
Ligand
BDBM50227929
Substrate
Meas. Tech.
ChEMBL_28503 (CHEMBL645932)
IC50
3540±n/a nM
Citation
 DeVries, VGBloom, JDDutia, MDKatocs, ASLargis, EE Potential antiatherosclerotic agents. 6. Hypocholesterolemic trisubstituted urea analogues. J Med Chem 32:2318-25 (1989)  
Target
Name:
Sterol O-acyltransferase 1
Synonyms:
ACAT-1 Acat SOAT1_RAT Sterol O-acyltransferase, Soat
Type:
PROTEIN
Mol. Mass.:
64165.56
Organism:
Rattus norvegicus
Description:
ChEMBL_28796
Residue:
545
  
Inhibitor
Name:
BDBM50227929
Synonyms:
CHEMBL419639
Type:
Small organic molecule
Emp. Form.:
C17H28N2O
Mol. Mass.:
276.417
SMILES:
CCCCN(CCCC)C(=O)Nc1cc(C)cc(C)c1
: