Target
Sterol O-acyltransferase 1
Ligand
BDBM50227930
Substrate
Meas. Tech.
ChEMBL_28503 (CHEMBL645932)
IC50
5810±n/a nM
Citation
 DeVries, VGBloom, JDDutia, MDKatocs, ASLargis, EE Potential antiatherosclerotic agents. 6. Hypocholesterolemic trisubstituted urea analogues. J Med Chem 32:2318-25 (1989)  
Target
Name:
Sterol O-acyltransferase 1
Synonyms:
ACAT-1 Acat SOAT1_RAT Sterol O-acyltransferase, Soat
Type:
PROTEIN
Mol. Mass.:
64165.56
Organism:
Rattus norvegicus
Description:
ChEMBL_28796
Residue:
545
  
Inhibitor
Name:
BDBM50227930
Synonyms:
CHEMBL77943
Type:
Small organic molecule
Emp. Form.:
C21H19BrN2O
Mol. Mass.:
395.292
SMILES:
Brc1cccc(NC(=O)N(Cc2ccccc2)Cc2ccccc2)c1
: