Target
cAMP-specific 3',5'-cyclic phosphodiesterase 4A/4B/4C/4D
Ligand
BDBM50241379
Substrate
Meas. Tech.
ChEMBL_156779 (CHEMBL756943)
IC50
>150000±n/a nM
Citation
 Matthews, DPMcCarthy, JRWhitten, JPKastner, PRBarney, CLMarshall, FNErtel, MABurkhard, TShea, PJKariya, T Synthesis and cardiotonic activity of novel biimidazoles. J Med Chem 33:317-27 (1990)  
Target
Name:
cAMP-specific 3',5'-cyclic phosphodiesterase 4A/4B/4C/4D
Synonyms:
Phosphodiesterase 4
Type:
Mol. Mass.:
Description:
ASSAY_ID of ChEMBL is 788178
Components:
This complex has 4 components.
Component 1
Name:
cAMP-specific 3',5'-cyclic phosphodiesterase 4A
Synonyms:
3',5'-cyclic phosphodiesterase PDE46 PDE4A_HUMAN Phosphodiesterase 4A | Phosphodiesterase 4A (PDE4)
Type:
Enzyme
Mol. Mass.:
98113.27
Organism:
Homo sapiens (Human)
Description:
P27815
Residue:
886
  
Component 2
Name:
cAMP-specific 3',5'-cyclic phosphodiesterase 4D
Synonyms:
3',5'-cyclic phosphodiesterase PDE43 PDE4D_HUMAN | Phosphodiesterase 4D
Type:
Protein
Mol. Mass.:
91092.69
Organism:
Homo sapiens (Human)
Description:
Q08499
Residue:
809
  
Component 3
Name:
cAMP-specific 3',5'-cyclic phosphodiesterase 4B
Synonyms:
3',5'-cyclic phosphodiesterase Isoform PDE4B1 PDE4B PDE4B_HUMAN Phosphodiesterase 4B (PDE4B) Phosphodiesterase Type 4 (PDE4B)
Type:
Protein
Mol. Mass.:
83318.87
Organism:
Homo sapiens (Human)
Description:
Q07343
Residue:
736
  
Component 4
Name:
cAMP-specific 3',5'-cyclic phosphodiesterase 4C
Synonyms:
3',5'-cyclic phosphodiesterase NP_000914.2 PDE4C | PDE4C1
Type:
Enzyme Catalytic Domain
Mol. Mass.:
79875.54
Organism:
Homo sapiens (Human)
Description:
Q08493
Residue:
712
  
Inhibitor
Name:
BDBM50241379
Synonyms:
(enoximone)4-Methyl-5-(4-methylsulfanyl-benzoyl)-1,3-dihydro-imidazol-2-one 4-Methyl-5-(4-methylsulfanyl-benzoyl)-1,3-dihydro-imidazol-2-one (Enoximone) 4-Methyl-5-(4-methylsulfanyl-benzoyl)-1,3-dihydro-imidazol-2-one(fenoximone, MDL-17043) CHEMBL249856 MDL-17043
Type:
Small organic molecule
Emp. Form.:
C12H12N2O2S
Mol. Mass.:
248.301
SMILES:
CSc1ccc(cc1)C(=O)c1[nH]c(=O)[nH]c1C
: