Target
cAMP-specific 3',5'-cyclic phosphodiesterase 4C
Ligand
BDBM50010981
Substrate
Meas. Tech.
ChEMBL_42946 (CHEMBL884266)
IC50
6000±n/a nM
Citation
 Saccomano, NAVinick, FJKoe, BKNielsen, JAWhalen, WMMeltz, MPhillips, DThadieo, PFJung, SChapin, DS Calcium-independent phosphodiesterase inhibitors as putative antidepressants: [3-(bicycloalkyloxy)-4-methoxyphenyl]-2-imidazolidinones. J Med Chem 34:291-8 (1991)  
Target
Name:
cAMP-specific 3',5'-cyclic phosphodiesterase 4C
Synonyms:
Dpde1 Pde4c
Type:
PROTEIN
Mol. Mass.:
60038.21
Organism:
Rattus norvegicus
Description:
ChEMBL_104732
Residue:
536
  
Inhibitor
Name:
BDBM50010981
Synonyms:
(Ro 20-1724)4-(3-Butoxy-4-methoxy-benzyl)-imidazolidin-2-one 4-(3-Butoxy-4-methoxy-benzyl)-imidazolidin-2-one(Ro 20-1724) CHEMBL18701 Ro-20-1724
Type:
Small organic molecule
Emp. Form.:
C15H22N2O3
Mol. Mass.:
278.3468
SMILES:
CCCCOc1cc(CC2CNC(=O)N2)ccc1OC
: