Target
cAMP-specific 3',5'-cyclic phosphodiesterase 4C
Ligand
BDBM50228832
Substrate
Meas. Tech.
ChEMBL_40449 (CHEMBL652387)
IC50
100±n/a nM
Citation
 Saccomano, NAVinick, FJKoe, BKNielsen, JAWhalen, WMMeltz, MPhillips, DThadieo, PFJung, SChapin, DS Calcium-independent phosphodiesterase inhibitors as putative antidepressants: [3-(bicycloalkyloxy)-4-methoxyphenyl]-2-imidazolidinones. J Med Chem 34:291-8 (1991)  
Target
Name:
cAMP-specific 3',5'-cyclic phosphodiesterase 4C
Synonyms:
Dpde1 Pde4c
Type:
PROTEIN
Mol. Mass.:
60038.21
Organism:
Rattus norvegicus
Description:
ChEMBL_104732
Residue:
536
  
Inhibitor
Name:
BDBM50228832
Synonyms:
CHEMBL100679
Type:
Small organic molecule
Emp. Form.:
C20H26N2O3
Mol. Mass.:
342.432
SMILES:
COc1ccc(cc1OC1CC2C1C1CCC2C1)C1CNC(=O)N1C
: