Target
cAMP-dependent protein kinase catalytic subunit gamma
Ligand
BDBM50216682
Substrate
Meas. Tech.
ChEMBL_161405 (CHEMBL768314)
Ki
3000±n/a nM
Citation
 Ricouart, AGesquiere, JCTartar, ASergheraert, C Design of potent protein kinase inhibitors using the bisubstrate approach. J Med Chem 34:73-8 (1991)  
Target
Name:
cAMP-dependent protein kinase catalytic subunit gamma
Synonyms:
KAPCG_HUMAN PRKACG cAMP-dependent protein kinase catalytic subunit gamma
Type:
PROTEIN
Mol. Mass.:
40442.03
Organism:
Homo sapiens (Human)
Description:
ChEMBL_104720
Residue:
351
  
Inhibitor
Name:
BDBM50216682
Synonyms:
1-(5-Isoquinolinesulfonyl)-2-methylpiperazine 5-(2-methylpiperazine-1-sulfonyl)isoquinoline cid_3542
Type:
Small organic molecule
Emp. Form.:
C14H17N3O2S
Mol. Mass.:
291.369
SMILES:
CC1CNCCN1S(=O)(=O)c1cccc2cnccc12
: