Target
cAMP-specific 3',5'-cyclic phosphodiesterase 4C
Ligand
BDBM50228865
Substrate
Meas. Tech.
ChEMBL_42939 (CHEMBL654581)
IC50
540±n/a nM
Citation
 Vinick, FJSaccomano, NAKoe, BKNielsen, JAWilliams, IHThadeio, PFJung, SMeltz, MJohnson, JLebel, LA Nicotinamide ethers: novel inhibitors of calcium-independent phosphodiesterase and [3H]rolipram binding. J Med Chem 34:86-9 (1991)  
Target
Name:
cAMP-specific 3',5'-cyclic phosphodiesterase 4C
Synonyms:
Dpde1 Pde4c
Type:
PROTEIN
Mol. Mass.:
60038.21
Organism:
Rattus norvegicus
Description:
ChEMBL_104732
Residue:
536
  
Inhibitor
Name:
BDBM50228865
Synonyms:
CHEMBL354430
Type:
Small organic molecule
Emp. Form.:
C20H17FN2O2
Mol. Mass.:
336.3596
SMILES:
Cc1ccc(CNC(=O)c2cccnc2Oc2ccc(F)cc2)cc1
: