Target
cAMP-specific 3',5'-cyclic phosphodiesterase 4C
Ligand
BDBM50218545
Substrate
Meas. Tech.
ChEMBL_176821 (CHEMBL780514)
IC50
14000±n/a nM
Citation
 Vinick, FJSaccomano, NAKoe, BKNielsen, JAWilliams, IHThadeio, PFJung, SMeltz, MJohnson, JLebel, LA Nicotinamide ethers: novel inhibitors of calcium-independent phosphodiesterase and [3H]rolipram binding. J Med Chem 34:86-9 (1991)  
Target
Name:
cAMP-specific 3',5'-cyclic phosphodiesterase 4C
Synonyms:
Dpde1 Pde4c
Type:
PROTEIN
Mol. Mass.:
60038.21
Organism:
Rattus norvegicus
Description:
ChEMBL_104732
Residue:
536
  
Inhibitor
Name:
BDBM50218545
Synonyms:
Nitraquazone
Type:
Small organic molecule
Emp. Form.:
C16H13N3O4
Mol. Mass.:
311.2921
SMILES:
CCn1c(=O)n(-c2cccc(c2)[N+]([O-])=O)c2ccccc2c1=O
: