Target
cAMP-specific 3',5'-cyclic phosphodiesterase 4C
Ligand
BDBM50229040
Substrate
Meas. Tech.
ChEMBL_42948 (CHEMBL656313)
IC50
40±n/a nM
Citation
 Lowe, JAArcher, RLChapin, DSChen, JBHelweg, DJohnson, JLKoe, BKLebel, LAMoore, PFNielsen, JA Structure-activity relationship of quinazolinedione inhibitors of calcium-independent phosphodiesterase. J Med Chem 34:624-8 (1991)  
Target
Name:
cAMP-specific 3',5'-cyclic phosphodiesterase 4C
Synonyms:
Dpde1 Pde4c
Type:
PROTEIN
Mol. Mass.:
60038.21
Organism:
Rattus norvegicus
Description:
ChEMBL_104732
Residue:
536
  
Inhibitor
Name:
BDBM50229040
Synonyms:
CHEMBL156140
Type:
Small organic molecule
Emp. Form.:
C22H17N3O4
Mol. Mass.:
387.3881
SMILES:
COC(=O)c1cccc(c1)-n1c2ncccc2c(=O)n(Cc2ccccc2)c1=O
: