Target
cAMP-specific 3',5'-cyclic phosphodiesterase 4C
Ligand
BDBM50229037
Substrate
Meas. Tech.
ChEMBL_157210 (CHEMBL768861)
IC50
>1000±n/a nM
Citation
 Lowe, JAArcher, RLChapin, DSChen, JBHelweg, DJohnson, JLKoe, BKLebel, LAMoore, PFNielsen, JA Structure-activity relationship of quinazolinedione inhibitors of calcium-independent phosphodiesterase. J Med Chem 34:624-8 (1991)  
Target
Name:
cAMP-specific 3',5'-cyclic phosphodiesterase 4C
Synonyms:
Dpde1 Pde4c
Type:
PROTEIN
Mol. Mass.:
60038.21
Organism:
Rattus norvegicus
Description:
ChEMBL_104732
Residue:
536
  
Inhibitor
Name:
BDBM50229037
Synonyms:
CHEMBL156328
Type:
Small organic molecule
Emp. Form.:
C22H16N2O4
Mol. Mass.:
372.3734
SMILES:
OC(=O)c1cccc(c1)-n1c2ccccc2c(=O)n(Cc2ccccc2)c1=O
: