Target
Alpha-2A adrenergic receptor [16-465]/Alpha-2B adrenergic receptor/Alpha-2C adrenergic receptor
Ligand
BDBM50229159
Substrate
Meas. Tech.
ChEMBL_32753 (CHEMBL641150)
Ki
1096±n/a nM
Citation
 Clark, RDRepke, DBBerger, JNelson, JTKilpatrick, ATBrown, CMMacKinnon, ACClague, RUSpedding, M Structure-affinity relationships of 12-sulfonyl derivatives of 5,8,8a,9,10,11,12,12a,13,13a-decahydro-6H-isoquino[2,1-g][1 ,6] naphthyridines at alpha-adrenoceptors. J Med Chem 34:705-17 (1991)  
Target
Name:
Alpha-2A adrenergic receptor [16-465]/Alpha-2B adrenergic receptor/Alpha-2C adrenergic receptor
Synonyms:
Adrenergic receptor alpha-2
Type:
Mol. Mass.:
Description:
ASSAY_ID of ChEMBL is 935397
Components:
This complex has 3 components.
Component 1
Name:
Alpha-2C adrenergic receptor
Synonyms:
ADA2C_RAT Adrenergic receptor alpha adrenergic Alpha2 | adrenergic Alpha2C
Type:
Enzyme Catalytic Domain
Mol. Mass.:
49890.50
Organism:
RAT
Description:
adrenergic Alpha2 0 RAT::P22086
Residue:
458
  
Component 2
Name:
Alpha-2B adrenergic receptor
Synonyms:
ADA2B_RAT Adrenergic receptor alpha Alpha-2B adrenergic receptor Alpha-2B adrenoreceptor | adrenergic Alpha2B
Type:
Enzyme Catalytic Domain
Mol. Mass.:
50379.83
Organism:
NEONATAL RAT
Description:
adrenergic Alpha2B ADRA2B NEONATAL RAT::P19328
Residue:
453
  
Component 3
Name:
Alpha-2A adrenergic receptor [16-465]
Synonyms:
ADA2A_RAT Adrenaline 2 Alpha-2A adrenoceptor Alpha-2AAR Alpha2 Adrenoreceptor adrenergic Alpha2A
Type:
G-protein coupled receptor
Mol. Mass.:
48961.69
Organism:
Rattus norvegicus (rat)
Description:
P22909[16-465]
Residue:
450
  
Inhibitor
Name:
BDBM50229159
Synonyms:
CHEMBL163571
Type:
Small organic molecule
Emp. Form.:
C17H24N2O2S
Mol. Mass.:
320.45
SMILES:
[H][C@@]12CCCN([C@]1([H])C[C@]1([H])N(CCc3ccccc13)C2)S(C)(=O)=O
: