Target
Alpha-1A/Alpha-1B/Alpha-1D adrenergic receptor
Ligand
BDBM50229150
Substrate
Meas. Tech.
ChEMBL_33139 (CHEMBL642094)
Ki
5623±n/a nM
Citation
 Clark, RDRepke, DBBerger, JNelson, JTKilpatrick, ATBrown, CMMacKinnon, ACClague, RUSpedding, M Structure-affinity relationships of 12-sulfonyl derivatives of 5,8,8a,9,10,11,12,12a,13,13a-decahydro-6H-isoquino[2,1-g][1 ,6] naphthyridines at alpha-adrenoceptors. J Med Chem 34:705-17 (1991)  
Target
Name:
Alpha-1A/Alpha-1B/Alpha-1D adrenergic receptor
Synonyms:
Adrenergic receptor alpha-1 alpha-1 Adrenergic Receptor
Type:
Mol. Mass.:
Description:
ASSAY_ID of EBI is 303470
Components:
This complex has 3 components.
Component 1
Name:
Alpha-1B adrenergic receptor
Synonyms:
ADA1B_RAT Alpha 1B-adrenoceptor Alpha adrenergic receptor 1A and 1B Alpha-1Adrenoceptor Alpha-1B adrenoreceptor | adrenergic Alpha1B
Type:
G Protein-Coupled Receptor (GPCR)
Mol. Mass.:
56606.71
Organism:
Rattus norvegicus (rat)
Description:
Receptor binding assays were performed using rat cortical membranes.
Residue:
515
  
Component 2
Name:
Alpha-1A adrenergic receptor
Synonyms:
ADA1A_RAT Adra1c Alpha-1A adrenoceptor Alpha-1C adrenergic receptor | adrenergic Alpha1A
Type:
Protein
Mol. Mass.:
51620.15
Organism:
Rattus norvegicus (Rat)
Description:
P43140
Residue:
466
  
Component 3
Name:
Alpha-1D adrenergic receptor
Synonyms:
ADA1D_RAT Adra1d Alpha-1D adrenergic receptor | Serotonin 1a (5-HT1a) receptor/Adrenergic receptor alpha-1
Type:
Protein
Mol. Mass.:
59375.97
Organism:
Rattus norvegicus (Rat)
Description:
P23944
Residue:
561
  
Inhibitor
Name:
BDBM50229150
Synonyms:
CHEMBL350393
Type:
Small organic molecule
Emp. Form.:
C19H29N3O3S
Mol. Mass.:
379.517
SMILES:
[H][C@]12CCCN([C@@]1([H])C[C@]1([H])N(CCc3cc(OC)ccc13)C2)S(=O)(=O)N(C)C
: