Target
Prostaglandin G/H synthase 1/2
Ligand
BDBM50229181
Substrate
Meas. Tech.
ChEMBL_223480 (CHEMBL846249)
IC50
6500000±n/a nM
Citation
 Self, CRBarber, WEMachin, PJOsbond, JMSmithen, CETong, BPWickens, JCBloxham, DPBradshaw, DCashin, CH Romazarit: a potential disease-modifying antirheumatic drug. J Med Chem 34:772-7 (1991)  
Target
Name:
Prostaglandin G/H synthase 1/2
Synonyms:
Cyclooxygenase
Type:
Mol. Mass.:
Description:
ASSAY_ID of ChEMBL is 1981650
Components:
This complex has 2 components.
Component 1
Name:
Prostaglandin G/H synthase 2
Synonyms:
COX2 Cyclooxygenase 2 (COX-2) Cyclooxygenase-2 (COX-2 AA) Cyclooxygenase-2 (COX-2) PGH2_HUMAN PHS II Prostaglandin E synthase/G/H synthase 2 Prostaglandin-endoperoxide synthase 2
Type:
Enzyme
Mol. Mass.:
69003.89
Organism:
Homo sapiens (Human)
Description:
Recombinant Cox-2 provided by Cayman (Cayman Chemical Co.,Ann Arbor, MI).
Residue:
604
  
Component 2
Name:
Prostaglandin G/H synthase 1
Synonyms:
COX-1 Cyclooxygenase Cyclooxygenase-1 (COX-1) PTGS1 | Prostaglandin G/H synthase (cyclooxygenase)
Type:
Enzyme
Mol. Mass.:
68692.62
Organism:
Homo sapiens (Human)
Description:
P23219
Residue:
599
  
Inhibitor
Name:
BDBM50229181
Synonyms:
Ro-313948000 | Romazarit
Type:
Small organic molecule
Emp. Form.:
C15H16ClNO4
Mol. Mass.:
309.745
SMILES:
Cc1nc(oc1COC(C)(C)C(O)=O)-c1ccc(Cl)cc1
: