Target
Sterol O-acyltransferase 1
Ligand
BDBM50229238
Substrate
Meas. Tech.
ChEMBL_28353 (CHEMBL644997)
IC50
15400±n/a nM
Citation
 Larsen, SDSpilman, CHBell, FPDinh, DMMartinborough, EWilson, GJ Synthesis and hypocholesterolemic activity of 6,7-dihydro-4H-pyrazolo[1,5-a]pyrrolo[3,4-d]pyrimidine-5,8-diones, novel inhibitors of acylCoA:cholesterol O-acyltransferase. J Med Chem 34:1721-7 (1991)  
Target
Name:
Sterol O-acyltransferase 1
Synonyms:
ACAT-1 Acat SOAT1_RAT Sterol O-acyltransferase, Soat
Type:
PROTEIN
Mol. Mass.:
64165.56
Organism:
Rattus norvegicus
Description:
ChEMBL_28796
Residue:
545
  
Inhibitor
Name:
BDBM50229238
Synonyms:
CHEMBL297097
Type:
Small organic molecule
Emp. Form.:
C29H28N4O2
Mol. Mass.:
464.5582
SMILES:
O=C1N(Cc2c1n(C\C=C\c1ccccc1)c1cc(nn1c2=O)-c1ccccc1)C1CCCCC1
: