Target
Type-1/Type-2 angiotensin II receptor
Ligand
BDBM50229418
Substrate
Meas. Tech.
ChEMBL_28432 (CHEMBL643135)
IC50
>15000±n/a nM
Citation
 Mohan, RChou, YLBihovsky, RLumma, WCErhardt, PWShaw, KJ Synthesis and biological activity of angiotensin II analogues containing a Val-His replacement, Val psi[CH(CONH2)NH]His. J Med Chem 34:2402-10 (1991)  
Target
Name:
Type-1/Type-2 angiotensin II receptor
Synonyms:
Angiotensin II receptor
Type:
Mol. Mass.:
Description:
ASSAY_ID of ChEMBL is 357784
Components:
This complex has 2 components.
Component 1
Name:
Type-1 angiotensin II receptor
Synonyms:
AGTR1 AGTR1B AT1 AT1BR AT2R1B Angiotensin II receptor Type-1 angiotensin II receptor (AT1)
Type:
Protein
Mol. Mass.:
41080.75
Organism:
Homo sapiens (Human)
Description:
P30556
Residue:
359
  
Component 2
Name:
Type-2 angiotensin II receptor
Synonyms:
AGTR2 AT2 Angiotensin II type 2 (AT-2) receptor Type-2 angiotensin II receptor
Type:
Enzyme Catalytic Domain
Mol. Mass.:
41201.61
Organism:
Homo sapiens (Human)
Description:
Angiotensin II, central 0 0::P50052
Residue:
363
  
Inhibitor
Name:
BDBM50229418
Synonyms:
CHEMBL76890
Type:
Small organic molecule
Emp. Form.:
C32H46N6O7
Mol. Mass.:
626.7436
SMILES:
CC[C@H](C)[C@H](NC(=O)[C@@H]1CCCN1C(=O)[C@H](Cc1c[nH]cn1)NC(=O)[C@@H](NC(=O)CCc1ccc(OC)cc1)C(C)C)C(O)=O
: