Target
Thymidine kinase
Ligand
BDBM50229852
Substrate
Meas. Tech.
ChEMBL_208028 (CHEMBL814155)
IC50
257040±n/a nM
Citation
 Gambino, JFocher, FHildebrand, CMaga, GNoonan, TSpadari, SWright, G Quantitative structure-activity relationships of N2-phenylguanines as inhibitors of herpes simplex virus thymidine kinases. J Med Chem 35:2979-83 (1992)  
Target
Name:
Thymidine kinase
Synonyms:
Type:
PROTEIN
Mol. Mass.:
40396.73
Organism:
Human herpesvirus 2
Description:
ChEMBL_474155
Residue:
376
  
Inhibitor
Name:
BDBM50229852
Synonyms:
CHEMBL298986
Type:
Small organic molecule
Emp. Form.:
C11H8FN5O
Mol. Mass.:
245.2125
SMILES:
Oc1[nH]c(Nc2ccc(F)cc2)nc2ncnc12
: