Target
Thymidine kinase
Ligand
BDBM50013088
Substrate
Meas. Tech.
ChEMBL_208025 (CHEMBL814153)
IC50
3020±n/a nM
Citation
 Gambino, JFocher, FHildebrand, CMaga, GNoonan, TSpadari, SWright, G Quantitative structure-activity relationships of N2-phenylguanines as inhibitors of herpes simplex virus thymidine kinases. J Med Chem 35:2979-83 (1992)  
Target
Name:
Thymidine kinase
Synonyms:
KITH_HHV1S Thymidine kinase | UL23
Type:
PROTEIN
Mol. Mass.:
40883.42
Organism:
Human herpesvirus 1 (strain SC16) (HHV-1) (Human herpes simplex virus1)
Description:
ChEMBL_213
Residue:
376
  
Inhibitor
Name:
BDBM50013088
Synonyms:
2-(3,4-Dibromo-phenylamino)-1,9-dihydro-purin-6-one | CHEMBL65438
Type:
Small organic molecule
Emp. Form.:
C11H7Br2N5O
Mol. Mass.:
385.014
SMILES:
Brc1ccc(Nc2nc3nc[nH]c3c(=O)[nH]2)cc1Br
: