Target
Thymidine kinase
Ligand
BDBM50229851
Substrate
Meas. Tech.
ChEMBL_208028 (CHEMBL814155)
IC50
199526±n/a nM
Citation
 Gambino, JFocher, FHildebrand, CMaga, GNoonan, TSpadari, SWright, G Quantitative structure-activity relationships of N2-phenylguanines as inhibitors of herpes simplex virus thymidine kinases. J Med Chem 35:2979-83 (1992)  
Target
Name:
Thymidine kinase
Synonyms:
Type:
PROTEIN
Mol. Mass.:
40396.73
Organism:
Human herpesvirus 2
Description:
ChEMBL_474155
Residue:
376
  
Inhibitor
Name:
BDBM50229851
Synonyms:
CHEMBL99634
Type:
Small organic molecule
Emp. Form.:
C13H13N5O2
Mol. Mass.:
271.2746
SMILES:
Cc1ccc(Nc2nc(O)c3[nH]cnc3n2)cc1CO
: