Target
Thymidine kinase
Ligand
BDBM50013098
Substrate
Meas. Tech.
ChEMBL_208028 (CHEMBL814155)
IC50
347±n/a nM
Citation
 Gambino, JFocher, FHildebrand, CMaga, GNoonan, TSpadari, SWright, G Quantitative structure-activity relationships of N2-phenylguanines as inhibitors of herpes simplex virus thymidine kinases. J Med Chem 35:2979-83 (1992)  
Target
Name:
Thymidine kinase
Synonyms:
Type:
PROTEIN
Mol. Mass.:
40396.73
Organism:
Human herpesvirus 2
Description:
ChEMBL_474155
Residue:
376
  
Inhibitor
Name:
BDBM50013098
Synonyms:
2-(3-Chloro-phenylamino)-1,9-dihydro-purin-6-one | CHEMBL52562
Type:
Small organic molecule
Emp. Form.:
C11H8ClN5O
Mol. Mass.:
261.667
SMILES:
Clc1cccc(Nc2nc3nc[nH]c3c(=O)[nH]2)c1
: