Target
Thymidine kinase
Ligand
BDBM50229865
Substrate
Meas. Tech.
ChEMBL_208025 (CHEMBL814153)
IC50
1000±n/a nM
Citation
 Gambino, JFocher, FHildebrand, CMaga, GNoonan, TSpadari, SWright, G Quantitative structure-activity relationships of N2-phenylguanines as inhibitors of herpes simplex virus thymidine kinases. J Med Chem 35:2979-83 (1992)  
Target
Name:
Thymidine kinase
Synonyms:
KITH_HHV1S Thymidine kinase | UL23
Type:
PROTEIN
Mol. Mass.:
40883.42
Organism:
Human herpesvirus 1 (strain SC16) (HHV-1) (Human herpes simplex virus1)
Description:
ChEMBL_213
Residue:
376
  
Inhibitor
Name:
BDBM50229865
Synonyms:
CHEMBL103645
Type:
Small organic molecule
Emp. Form.:
C12H10BrN5O
Mol. Mass.:
320.145
SMILES:
Oc1[nH]c(Nc2cccc(CBr)c2)nc2ncnc12
: