Target
Thymidine kinase
Ligand
BDBM50013084
Substrate
Meas. Tech.
ChEMBL_208028 (CHEMBL814155)
IC50
19953±n/a nM
Citation
 Gambino, JFocher, FHildebrand, CMaga, GNoonan, TSpadari, SWright, G Quantitative structure-activity relationships of N2-phenylguanines as inhibitors of herpes simplex virus thymidine kinases. J Med Chem 35:2979-83 (1992)  
Target
Name:
Thymidine kinase
Synonyms:
Type:
PROTEIN
Mol. Mass.:
40396.73
Organism:
Human herpesvirus 2
Description:
ChEMBL_474155
Residue:
376
  
Inhibitor
Name:
BDBM50013084
Synonyms:
2-(4-Hydroxy-phenylamino)-1,9-dihydro-purin-6-one | CHEMBL53890
Type:
Small organic molecule
Emp. Form.:
C11H9N5O2
Mol. Mass.:
243.2215
SMILES:
Oc1ccc(Nc2nc3nc[nH]c3c(=O)[nH]2)cc1
: