Target
Muscarinic acetylcholine receptor
Ligand
BDBM50229871
Substrate
Meas. Tech.
ChEMBL_138190 (CHEMBL747834)
Kd
1905±n/a nM
Citation
 Bravo, PResnati, GAngeli, PFrigerio, MViani, FArnone, AMarucci, GCantalamessa, F Synthesis and pharmacological evaluation of enantiomerically pure 4-deoxy-4-fluoromuscarines. J Med Chem 35:3102-10 (1992)  
Target
Name:
Muscarinic acetylcholine receptor
Synonyms:
GPM3 | Muscarinic acetylcholine receptor M3
Type:
Mol. Mass.:
66272.13
Organism:
Cavia porcellus
Description:
Residue:
587
  
Inhibitor
Name:
BDBM50229871
Synonyms:
CHEMBL316804
Type:
Small organic molecule
Emp. Form.:
C9H19FINO
Mol. Mass.:
303.1561
SMILES:
[I-].C[C@@H]1O[C@H](C[N+](C)(C)C)C[C@H]1F
: