Target
Myeloperoxidase
Ligand
BDBM50229902
Substrate
Meas. Tech.
ChEMBL_223053 (CHEMBL841524)
EC50
<3000±n/a nM
Comments
Zero 20220115
Citation
 Lanza, TJDurette, PLRollins, TSiciliano, SCianciarulo, DNKobayashi, SVCaldwell, CGSpringer, MSHagmann, WK Substituted 4,6-diaminoquinolines as inhibitors of C5a receptor binding. J Med Chem 35:252-8 (1992)  
Target
Name:
Myeloperoxidase
Synonyms:
84 kDa myeloperoxidase MPO Myeloperoxidase Myeloperoxidase heavy chain PERM_HUMAN
Type:
Enzyme
Mol. Mass.:
83888.32
Organism:
Homo sapiens (Human)
Description:
P05164
Residue:
745
  
Inhibitor
Name:
BDBM50229902
Synonyms:
CHEMBL313562
Type:
Small organic molecule
Emp. Form.:
C22H20N6O2
Mol. Mass.:
400.4332
SMILES:
Cc1cc(N)c2cc(NC(=O)C(=O)Nc3ccc4nc(C)cc(N)c4c3)ccc2n1
: