Target
Myeloperoxidase
Ligand
BDBM55880
Substrate
Meas. Tech.
ChEMBL_223053 (CHEMBL841524)
EC50
<3000±n/a nM
Comments
Zero 20220115
Citation
 Lanza, TJDurette, PLRollins, TSiciliano, SCianciarulo, DNKobayashi, SVCaldwell, CGSpringer, MSHagmann, WK Substituted 4,6-diaminoquinolines as inhibitors of C5a receptor binding. J Med Chem 35:252-8 (1992)  
Target
Name:
Myeloperoxidase
Synonyms:
84 kDa myeloperoxidase MPO Myeloperoxidase Myeloperoxidase heavy chain PERM_HUMAN
Type:
Enzyme
Mol. Mass.:
83888.32
Organism:
Homo sapiens (Human)
Description:
P05164
Residue:
745
  
Inhibitor
Name:
BDBM55880
Synonyms:
(E)-N-(4-amino-2-methyl-6-quinolinyl)-3-(2-chlorophenyl)-2-propenamide (E)-N-(4-amino-2-methylquinolin-6-yl)-3-(2-chlorophenyl)prop-2-enamide MLS000737665 cid_5773323
Type:
Small organic molecule
Emp. Form.:
C19H16ClN3O
Mol. Mass.:
337.803
SMILES:
Cc1cc(N)c2cc(NC(=O)\C=C\c3ccccc3Cl)ccc2n1
: