Target
Cannabinoid receptor 1/2
Ligand
BDBM50008022
Substrate
Meas. Tech.
ChEMBL_46144 (CHEMBL660017)
IC50
3053±n/a nM
Citation
 D'Ambra, TEEstep, KGBell, MREissenstat, MAJosef, KAWard, SJHaycock, DABaizman, ERCasiano, FMBeglin, NC Conformationally restrained analogues of pravadoline: nanomolar potent, enantioselective, (aminoalkyl)indole agonists of the cannabinoid receptor. J Med Chem 35:124-35 (1992)  
Target
Name:
Cannabinoid receptor 1/2
Synonyms:
Cannabinoid receptor
Type:
Mol. Mass.:
Description:
ASSAY_ID of ChEMBL is 1859866
Components:
This complex has 2 components.
Component 1
Name:
Cannabinoid receptor 2
Synonyms:
CANNABINOID CB2 CB2 Cannabinoid CB2 receptor Cnr2 | rCB2
Type:
Enzyme
Mol. Mass.:
39366.68
Organism:
Rattus norvegicus (Rat)
Description:
Q9QZN9
Residue:
360
  
Component 2
Name:
Cannabinoid receptor 1
Synonyms:
Brain-type cannabinoid receptor CB-R CNR1_RAT Cannabinoid receptor Cnr1 | Skr6
Type:
G Protein-Coupled Receptor (GPCR)
Mol. Mass.:
52856.55
Organism:
Rattus norvegicus (rat)
Description:
P20272
Residue:
473
  
Inhibitor
Name:
BDBM50008022
Synonyms:
(4-Methoxy-phenyl)-(3-morpholin-4-ylmethyl-2,3-dihydro-1H-3a-aza-cyclopenta[a]inden-8-yl)-methanone CHEMBL28045
Type:
Small organic molecule
Emp. Form.:
C24H26N2O3
Mol. Mass.:
390.4748
SMILES:
COc1ccc(cc1)C(=O)c1c2CCC(CN3CCOCC3)n2c2ccccc12
: