Target
Lutropin-choriogonadotropic hormone receptor
Ligand
BDBM50230123
Substrate
Meas. Tech.
ChEMBL_100017 (CHEMBL709254)
Ki
0.093325±n/a nM
Citation
 Haviy, FFitzpatrick, TDNichols, CJSwenson, REBush, ENDiaz, GNguyen, ANellans, HNHoffman, DJGhanbari, H Stabilization of the N-terminal residues of luteinizing hormone-releasing hormone agonists and the effect on pharmacokinetics. J Med Chem 35:3890-4 (1992)  
Target
Name:
Lutropin-choriogonadotropic hormone receptor
Synonyms:
LH/CG-R LSHR_RAT Luteinizing hormone receptor Lutropin-choriogonadotropic hormone receptor
Type:
PROTEIN
Mol. Mass.:
78049.26
Organism:
Rattus norvegicus
Description:
ChEMBL_97289
Residue:
700
  
Inhibitor
Name:
BDBM50230123
Synonyms:
CHEMBL385042
Type:
Small organic molecule
Emp. Form.:
C61H85N15O12
Mol. Mass.:
1220.4209
SMILES:
CCNC(=O)[C@H]1CCCN1C(=O)[C@H](CCCN=C(N)N)NC(=O)[C@H](CC(C)C)NC(=O)[C@@H](CC(C)C)NC(=O)[C@H](Cc1ccc(O)cc1)NC(=O)[C@H](CO)NC(=O)[C@H](Cc1cccc2ccccc12)NC(=O)[C@H](Cc1c[nH]cn1)NC(=O)[C@@H]1CCC(=O)N1
: