Target
Carbonic anhydrase 6
Ligand
BDBM50004172
Substrate
Meas. Tech.
ChEMBL_47171 (CHEMBL877290)
IC50
23±n/a nM
Citation
 Lo, YSNolan, JCMaren, THWelstead, WJGripshover, DFShamblee, DA Synthesis and physicochemical properties of sulfamate derivatives as topical antiglaucoma agents. J Med Chem 35:4790-4 (1992)  
Target
Name:
Carbonic anhydrase 6
Synonyms:
CA-VI CAH6_BOVIN Carbonic anhydrase 6 Salivary carbonic anhydrase | Secreted carbonic anhydrase
Type:
PROTEIN
Mol. Mass.:
37008.14
Organism:
Bos taurus
Description:
ChEMBL_104851
Residue:
319
  
Inhibitor
Name:
BDBM50004172
Synonyms:
CHEMBL544763 | Sulfamic acid 2-(4-imidazol-1-yl-phenoxy)-ethyl ester; hydrochloride
Type:
Small organic molecule
Emp. Form.:
C11H13N3O4S
Mol. Mass.:
283.304
SMILES:
NS(=O)(=O)OCCOc1ccc(cc1)-n1ccnc1
: