Target
Potassium-transporting ATPase alpha chain 1/subunit beta
Ligand
BDBM50070208
Substrate
Meas. Tech.
ChEMBL_76088 (CHEMBL858329)
IC50
398±n/a nM
Citation
 Kohl, BSturm, ESenn-Bilfinger, JSimon, WAKrüger, USchaefer, HRainer, GFigala, VKlemm, K (H+,K+)-ATPase inhibiting 2-[(2-pyridylmethyl)sulfinyl]benzimidazoles. 4. A novel series of dimethoxypyridyl-substituted inhibitors with enhanced selectivity. The selection of pantoprazole as a clinical candidate. J Med Chem 35:1049-57 (1992)  
Target
Name:
Potassium-transporting ATPase alpha chain 1/subunit beta
Synonyms:
Potassium-transporting ATPase | Potassium-transporting ATPase alpha chain 1/beta chain
Type:
Mol. Mass.:
Description:
ASSAY_ID of EBI is 71495
Components:
This complex has 2 components.
Component 1
Name:
Potassium-transporting ATPase alpha chain 1
Synonyms:
ATP4A Gastric H(+)/K(+) ATPase subunit alpha Potassium-transporting ATPase alpha chain 1 | Proton pump
Type:
PROTEIN
Mol. Mass.:
114109.05
Organism:
Homo sapiens (Human)
Description:
EBI_82
Residue:
1035
  
Component 2
Name:
Potassium-transporting ATPase subunit beta
Synonyms:
ATP4B Gastric H(+)/K(+) ATPase subunit beta Potassium-transporting ATPase subunit beta | Proton pump beta chain
Type:
PROTEIN
Mol. Mass.:
33369.83
Organism:
Homo sapiens (Human)
Description:
EBI_10719
Residue:
291
  
Inhibitor
Name:
BDBM50070208
Synonyms:
A-65006 CHEBI:6375 Prevacid Prevacid Delayed Release Prevacid iv
Type:
Small organic molecule
Emp. Form.:
C16H14F3N3O2S
Mol. Mass.:
369.361
SMILES:
Cc1c(OCC(F)(F)F)ccnc1C[S+]([O-])c1nc2ccccc2[nH]1
: