Target
Similar to alpha-tubulin isoform 1
Ligand
BDBM50230635
Substrate
Meas. Tech.
ChEMBL_211320 (CHEMBL818979)
IC50
1900±n/a nM
Citation
 Getahun, ZJurd, LChu, PSLin, CMHamel, E Synthesis of alkoxy-substituted diaryl compounds and correlation of ring separation with inhibition of tubulin polymerization: differential enhancement of inhibitory effects under suboptimal polymerization reaction conditions. J Med Chem 35:1058-67 (1992)  
Target
Name:
Similar to alpha-tubulin isoform 1
Synonyms:
Similar to alpha-tubulin isoform 1
Type:
PROTEIN
Mol. Mass.:
10383.05
Organism:
Bos taurus
Description:
ChEMBL_104716
Residue:
99
  
Inhibitor
Name:
BDBM50230635
Synonyms:
CHEMBL10642
Type:
Small organic molecule
Emp. Form.:
C19H20O4
Mol. Mass.:
312.3597
SMILES:
CCOc1cc2OCOc2cc1C\C=C\c1ccc(OC)cc1
: