Target
Gastrin/cholecystokinin type B receptor
Ligand
BDBM50230670
Substrate
Meas. Tech.
ChEMBL_48424 (CHEMBL660352)
Ki
93±n/a nM
Citation
 Higginbottom, MKneen, CRatcliffe, GS Rationally designed"dipeptoid" analogues of CCK. A Free-Wilson/Fujita-Ban analysis of some alpha-methyltryptophan derivatives as CCK-B antagonists. J Med Chem 35:1572-7 (1992)  
Target
Name:
Gastrin/cholecystokinin type B receptor
Synonyms:
Cckbr Cholecystokinin receptor Gastrin/cholecystokinin type B receptor
Type:
Enzyme Catalytic Domain
Mol. Mass.:
49196.59
Organism:
MOUSE
Description:
Cholecystokinin A CCKBR MOUSE::P56481
Residue:
453
  
Inhibitor
Name:
BDBM50230670
Synonyms:
CHEMBL3350394
Type:
Small organic molecule
Emp. Form.:
C32H37N3O5
Mol. Mass.:
543.6533
SMILES:
OC(=O)C[C@@H](Cc1ccccc1)NC(=O)[C@H](Cc1c[nH]c2ccccc12)NC(=O)OC1C2CC3CC(C2)CC1C3
: