Target
Gastrin/cholecystokinin type B receptor
Ligand
BDBM50230688
Substrate
Meas. Tech.
ChEMBL_48424 (CHEMBL660352)
Ki
15±n/a nM
Citation
 Higginbottom, MKneen, CRatcliffe, GS Rationally designed"dipeptoid" analogues of CCK. A Free-Wilson/Fujita-Ban analysis of some alpha-methyltryptophan derivatives as CCK-B antagonists. J Med Chem 35:1572-7 (1992)  
Target
Name:
Gastrin/cholecystokinin type B receptor
Synonyms:
Cckbr Cholecystokinin receptor Gastrin/cholecystokinin type B receptor
Type:
Enzyme Catalytic Domain
Mol. Mass.:
49196.59
Organism:
MOUSE
Description:
Cholecystokinin A CCKBR MOUSE::P56481
Residue:
453
  
Inhibitor
Name:
BDBM50230688
Synonyms:
CHEMBL3351019
Type:
Small organic molecule
Emp. Form.:
C32H41N3O4
Mol. Mass.:
531.6856
SMILES:
C[C@](Cc1c[nH]c2ccccc12)(NC(=O)OC1CC2CCC1(C)C2(C)C)C(=O)N[C@H](CO)Cc1ccccc1
: