Target
5-hydroxytryptamine receptor 1A
Ligand
BDBM50056445
Substrate
Meas. Tech.
ChEMBL_1081 (CHEMBL616404)
Kd
501±n/a nM
Citation
 King, FDBrown, AMGaster, LMKaumann, AJMedhurst, ADParker, SGParsons, AAPatch, TLRaval, P (+/-) 3-Amino-6-carboxamido-1,2,3,4-tetrahydrocarbazole: a conformationally restricted analogue of 5-carboxamidotryptamine with selectivity for the serotonin 5-HT1D receptor. J Med Chem 36:1918-9 (1993)  
Target
Name:
5-hydroxytryptamine receptor 1A
Synonyms:
5-HT-1A 5-hydroxytryptamine receptor 1A (5-HT-1A) ADRB2RL1 Dopamine D2 receptor and serotonin 1a receptor HTR1A | Serotonin receptor 1A
Type:
Mol. Mass.:
46122.49
Organism:
Homo sapiens (Human)
Description:
Residue:
422
  
Inhibitor
Name:
BDBM50056445
Synonyms:
1,1-diethyl-3-[(8alpha)-6-methyl-9,10-didehydroergolin-8-yl]urea N'-((8alpha)-9,10-Didehydro-6-methylergolin-8-yl)-N,N-diethylurea lisuride, (S)
Type:
Small organic molecule
Emp. Form.:
C20H26N4O
Mol. Mass.:
338.4466
SMILES:
CCN(CC)C(=O)N[C@@H]1CN(C)[C@@H]2Cc3c[nH]c4cccc(C2=C1)c34
: